Target
Hypoxanthine phosphoribosyltransferase
Ligand
BDBM60888
Substrate
Meas. Tech.
Growth Inhibition Assay
Temperature
310.15±n/a K
Ki
>250000±n/a nM
Comments
extracted
Citation
 De Jersey, JGuddat, LWHockova, DKeough, DT 6-oxopurine phosphoribosyltransferase inhibitors US Patent  US9200020 Publication Date 12/1/2015 
Target
Name:
Hypoxanthine phosphoribosyltransferase
Synonyms:
Hypoxanthine-guanine phosphoribosyltransferase (HGPRT)
Type:
Enzyme
Mol. Mass.:
26972.31
Organism:
Plasmodium vivax
Description:
A0A0J9TE27
Residue:
233
  
Inhibitor
Name:
BDBM60888
Synonyms:
US9200020, Table 3, Compound 3B
Type:
Emp. Form.:
C14H23N5O6P
Mol. Mass.:
388.3361
SMILES:
COC(=O)CCCN(CCn1c[nH]c2c1nc[nH]c2=O)CCP(O)(O)=O
: