Target
Hypoxanthine phosphoribosyltransferase
Ligand
BDBM194495
Substrate
Meas. Tech.
Growth Inhibition Assay
Temperature
310.15±n/a K
Ki
47000±5000 nM
Comments
extracted
Citation
 De Jersey, JGuddat, LWHockova, DKeough, DT 6-oxopurine phosphoribosyltransferase inhibitors US Patent  US9200020 Publication Date 12/1/2015 
Target
Name:
Hypoxanthine phosphoribosyltransferase
Synonyms:
Hypoxanthine-guanine phosphoribosyltransferase (HGPRT)
Type:
Enzyme
Mol. Mass.:
26972.31
Organism:
Plasmodium vivax
Description:
A0A0J9TE27
Residue:
233
  
Inhibitor
Name:
BDBM194495
Synonyms:
US9200020, Table 3 compound 4
Type:
Small organic molecule
Emp. Form.:
C11H16N6O4P
Mol. Mass.:
327.2563
SMILES:
OP(O)(=O)CCN(CCn1c[nH]c2c1nc[nH]c2=O)CC#N
: