Target
Hypoxanthine phosphoribosyltransferase
Ligand
BDBM60891
Substrate
Meas. Tech.
Growth Inhibition Assay
Temperature
310.15±n/a K
Ki
>230000±n/a nM
Comments
extracted
Citation
 De Jersey, JGuddat, LWHockova, DKeough, DT 6-oxopurine phosphoribosyltransferase inhibitors US Patent  US9200020 Publication Date 12/1/2015 
Target
Name:
Hypoxanthine phosphoribosyltransferase
Synonyms:
Hypoxanthine-guanine phosphoribosyltransferase (HGPRT)
Type:
Enzyme
Mol. Mass.:
26972.31
Organism:
Plasmodium vivax
Description:
A0A0J9TE27
Residue:
233
  
Inhibitor
Name:
BDBM60891
Synonyms:
US9200020, Table 3 compound 6B
Type:
Emp. Form.:
C13H20N6O4P
Mol. Mass.:
355.3095
SMILES:
OP(O)(=O)CCN(CCCC#N)CCn1c[nH]c2c1nc[nH]c2=O
: