Target
Transitional endoplasmic reticulum ATPase
Ligand
BDBM194594
Substrate
Meas. Tech.
Inhibition Assay
pH
8±n/a
Temperature
310.15±n/a K
IC50
170±n/a nM
Comments
extracted
Citation
 Kakizuka, AHori, SIkeda, HYoshimura, NNakano, NShudo, TFuchigami, T Agent for treatment of eye diseases US Patent  US9206129 Publication Date 12/8/2015 
Target
Name:
Transitional endoplasmic reticulum ATPase
Synonyms:
TERA_MOUSE Vcp
Type:
Protein
Mol. Mass.:
89300.63
Organism:
Mus musculus (Mouse)
Description:
Q01853
Residue:
806
  
Inhibitor
Name:
BDBM194594
Synonyms:
US9206129, 10
Type:
Small organic molecule
Emp. Form.:
C22H14F3N4NaO3S
Mol. Mass.:
494.422
SMILES:
Nc1c(cc(c2ccccc12)S(=O)(=O)O[Na])\N=N\c1ccc(nc1)-c1ccccc1C(F)(F)F
: