Target
Transitional endoplasmic reticulum ATPase
Ligand
BDBM194637
Substrate
Meas. Tech.
Inhibition Assay
pH
8±n/a
Temperature
310.15±n/a K
IC50
161±n/a nM
Comments
extracted
Citation
 Kakizuka, AHori, SIkeda, HYoshimura, NNakano, NShudo, TFuchigami, T Agent for treatment of eye diseases US Patent  US9206129 Publication Date 12/8/2015 
Target
Name:
Transitional endoplasmic reticulum ATPase
Synonyms:
TERA_MOUSE Vcp
Type:
Protein
Mol. Mass.:
89300.63
Organism:
Mus musculus (Mouse)
Description:
Q01853
Residue:
806
  
Inhibitor
Name:
BDBM194637
Synonyms:
US9206129, 53
Type:
Small organic molecule
Emp. Form.:
C27H25N4NaO5S
Mol. Mass.:
540.566
SMILES:
CCCCOc1c(C=O)cc(C)cc1-c1ccc(cn1)\N=N\c1cc(c2ccccc2c1N)S(=O)(=O)O[Na]
: