Target
5-hydroxytryptamine receptor 2A
Ligand
BDBM194790
Substrate
Meas. Tech.
Serotonin 5-HT2A Receptor Binding Assay
pH
7.4±n/a
Temperature
310.15±n/a K
Ki
5.7±n/a nM
Comments
extracted
Citation
 Yamashita, HIto, NMiyamura, SOshima, KMatsubara, JKuroda, HTakahashi, HShimizu, STanaka, T Piperazine-substituted benzothiophenes for treatment of mental disorders US Patent  US9206167 Publication Date 12/8/2015 
Target
Name:
5-hydroxytryptamine receptor 2A
Synonyms:
5-HT-2A 5-HT2A 5-hydroxytryptamine receptor 2A (5HT2A) Htr2 Serotonin Receptor 2A
Type:
G Protein-Coupled Receptor (GPCR)
Mol. Mass.:
52852.05
Organism:
Rattus norvegicus (rat)
Description:
Rat cortex membranes 5-HT2A receptors.
Residue:
471
  
Inhibitor
Name:
BDBM194790
Synonyms:
US9206167, 11 USRE48059, Compound of Example 12
Type:
Small organic molecule
Emp. Form.:
C25H29N3O2S
Mol. Mass.:
435.582
SMILES:
O=C1CCc2ccc(OCCCCN3CCN(CC3)c3cccc4sccc34)cc2N1
: