Target
Induced myeloid leukemia cell differentiation protein Mcl-1
Ligand
BDBM289084
Substrate
Meas. Tech.
Bak Peptide Binding Assay
pH
7.5±n/a
Temperature
298.15±n/a K
IC50
<100±n/a nM
Comments
extracted
Citation
 Chen, CHChen, ZFortanet, JGGrunenfelder, DKarki, RKato, MLaMarche, MJPerez, LBStams, TMWilliams, S 1-pyridazin-/triazin-3-yl-piper(-azine)/idine/pyrolidine derivatives and compositions thereof for inhibiting the activity of SHP2 US Patent  US10093646 Publication Date 10/9/2018 
Target
Name:
Induced myeloid leukemia cell differentiation protein Mcl-1
Synonyms:
BCL2L3 Bcl-2-like protein 3 (Mcl-1) Bcl2-L-3 MCL1 Mcl-1 Myeloid cell leukemia sequence 1 (BCL2-related) | mcl1/EAT
Type:
Membrane; Single-pass membrane protein
Mol. Mass.:
37332.87
Organism:
Homo sapiens (Human)
Description:
Q07820
Residue:
350
  
Inhibitor
Name:
BDBM289084
Synonyms:
3-(3-(4-chloro-3,5-dimethylphenoxy)propyl)-7-(3-((2-(dimethylamino)ethoxy)methyl)-1,5-dimethyl-1H-pyrazol-4-yl)-N-(phenylsulfonyl)-1H-indole-2-carboxamide US10844032, Example 308
Type:
Small organic molecule
Emp. Form.:
C36H42ClN5O5S
Mol. Mass.:
692.267
SMILES:
CN(C)CCOCc1nn(C)c(C)c1-c1cccc2c(CCCOc3cc(C)c(Cl)c(C)c3)c([nH]c12)C(=O)NS(=O)(=O)c1ccccc1
: