Target
ATP-sensitive inward rectifier potassium channel 1
Ligand
BDBM195915
Substrate
Meas. Tech.
Thallium Flux Assay
IC50
120±n/a nM
Citation
 Pio, BPasternak, AShahripour, ATang, HWalsh, S Inhibitors of the renal outer medullary potassium channel US Patent  US9206199 Publication Date 12/8/2015 
Target
Name:
ATP-sensitive inward rectifier potassium channel 1
Synonyms:
ATP-regulated potassium channel ROM-K ATP-sensitive inward rectifier potassium channel 1 KCNJ1 Potassium channel (ATP modulatory) ROMK1 The Renal Outer Medullary Potassium (ROMK)
Type:
Enzyme Catalytic Domain
Mol. Mass.:
44809.08
Organism:
Homo sapiens (Human)
Description:
gi_223460826
Residue:
391
  
Inhibitor
Name:
BDBM195915
Synonyms:
US9206199, 12
Type:
Small organic molecule
Emp. Form.:
C22H20F2N8O2
Mol. Mass.:
466.4434
SMILES:
Fc1ccc([C@H]2CN3CCN(C[C@H]3CO2)C(=O)Cc2ccc(nc2)-n2cnnn2)c(F)c1[N+]#[C-]
: