Target
ATP-sensitive inward rectifier potassium channel 1
Ligand
BDBM196058
Substrate
Meas. Tech.
Thallium Flux Assay
IC50
210±n/a nM
Citation
 Pio, BPasternak, AShahripour, ATang, HWalsh, S Inhibitors of the renal outer medullary potassium channel US Patent  US9206199 Publication Date 12/8/2015 
Target
Name:
ATP-sensitive inward rectifier potassium channel 1
Synonyms:
ATP-regulated potassium channel ROM-K ATP-sensitive inward rectifier potassium channel 1 KCNJ1 Potassium channel (ATP modulatory) ROMK1 The Renal Outer Medullary Potassium (ROMK)
Type:
Enzyme Catalytic Domain
Mol. Mass.:
44809.08
Organism:
Homo sapiens (Human)
Description:
gi_223460826
Residue:
391
  
Inhibitor
Name:
BDBM196058
Synonyms:
US9206199, 163 | US9206199, 164
Type:
Small organic molecule
Emp. Form.:
C25H27N7O4
Mol. Mass.:
489.5264
SMILES:
Cc1c2COC(=O)c2ccc1C1CN2CCN(CC2CCO1)C(=O)Cc1ccc(nc1)-n1cnnn1
: