Target
Histone deacetylase 6 [440-798]
Ligand
BDBM198124
Substrate
Meas. Tech.
HDAC6 fluorescence anisotropy assay
Temperature
298.15±n/a K
Ki
1.4±0.3 nM
IC50
2.5±0.5 nM
Comments
extracted
Citation
 Hai, YUniversity of Pennsylvania,, DW Histone deacetylase 6 structure and molecular basis of catalysis and inhibition Nat Chem Biol 12:741-747 (2016)  
Target
Name:
Histone deacetylase 6 [440-798]
Synonyms:
Catalytic domain 2 (zCD2) | zCD2
Type:
Mol. Mass.:
39850.25
Organism:
Danio rerio
Description:
F8W4B7[440-798]
Residue:
359
  
Inhibitor
Name:
BDBM198124
Synonyms:
Panobinostat
Type:
Small organic molecule
Emp. Form.:
C21H23N3O2
Mol. Mass.:
349.4262
SMILES:
Cc1[nH]c2ccccc2c1CCNCc1ccc(C=CC(=O)NO)cc1
: