Target
Metabotropic glutamate receptor 6
Ligand
BDBM196908
Substrate
Meas. Tech.
Pharmacological Assay
EC50
9000±800 nM
Citation
 Acher, FPin, JGoudet, CEschalier, ABusserolles, JRigault, DLemasson, ICesarini, SCommare, B Hypophosphorous acid derivatives having antihyperalgic activity and biological applications thereof US Patent  US9212196 Publication Date 12/15/2015 
Target
Name:
Metabotropic glutamate receptor 6
Synonyms:
GRM6_RAT Grm6 Metabotropic glutamate receptor 6 (mGlu6) mGlu6 | metabotropic glutamate 6
Type:
Enzyme
Mol. Mass.:
95095.82
Organism:
Rattus norvegicus (Rat)
Description:
P35349
Residue:
871
  
Inhibitor
Name:
BDBM196908
Synonyms:
US9212196, Derivative 4
Type:
Small organic molecule
Emp. Form.:
C15H22NO10P
Mol. Mass.:
407.3096
SMILES:
COc1cc(cc(OC)c1OCC(O)=O)C(O)P(O)(=O)CC[C@@H](N)C(O)=O
: