Target
Nuclear receptor ROR-gamma
Ligand
BDBM50090175
Substrate
Meas. Tech.
In Vitro Assay
pH
7.4±n/a
IC50
18±n/a nM
Comments
extracted
Citation
 Fauber, BRene, O Benzyl sulfonamide derivatives as RORc modulators US Patent  US9216988 Publication Date 12/22/2015 
Target
Name:
Nuclear receptor ROR-gamma
Synonyms:
NR1F3 Nuclear receptor ROR-gamma (RORC) RAR-related orphan receptor C (RORc) RORG RZRG Retinoid-related orphan receptor-gamma (RORc)
Type:
Enzyme Catalytic Domain
Mol. Mass.:
58218.40
Organism:
Homo sapiens (Human)
Description:
P51449
Residue:
518
  
Inhibitor
Name:
BDBM50090175
Synonyms:
CHEMBL3581554 | US9216988, 17
Type:
Small organic molecule
Emp. Form.:
C27H36FN3O3S
Mol. Mass.:
501.656
SMILES:
CC(=O)N1CCN(CC1)c1ccc(CN(C2CCC2)S(=O)(=O)c2ccc(cc2)C(C)(C)C)c(F)c1
: