Target
Nuclear receptor ROR-gamma
Ligand
BDBM197800
Substrate
Meas. Tech.
In Vitro Assay
pH
7.4±n/a
IC50
35±n/a nM
Comments
extracted
Citation
 Fauber, BRene, O Benzyl sulfonamide derivatives as RORc modulators US Patent  US9216988 Publication Date 12/22/2015 
Target
Name:
Nuclear receptor ROR-gamma
Synonyms:
NR1F3 Nuclear receptor ROR-gamma (RORC) RAR-related orphan receptor C (RORc) RORG RZRG Retinoid-related orphan receptor-gamma (RORc)
Type:
Enzyme Catalytic Domain
Mol. Mass.:
58218.40
Organism:
Homo sapiens (Human)
Description:
P51449
Residue:
518
  
Inhibitor
Name:
BDBM197800
Synonyms:
US9216988, 28
Type:
Small organic molecule
Emp. Form.:
C26H34FN3O3S
Mol. Mass.:
487.63
SMILES:
CC(C)c1ccc(cc1)S(=O)(=O)N(Cc1ccc(cc1F)N1CCN(CC1)C(C)=O)C1CCC1
: