Target
Nuclear receptor ROR-gamma
Ligand
BDBM50090123
Substrate
Meas. Tech.
In Vitro Assay
pH
7.4±n/a
IC50
36±n/a nM
Comments
extracted
Citation
 Fauber, BRene, O Benzyl sulfonamide derivatives as RORc modulators US Patent  US9216988 Publication Date 12/22/2015 
Target
Name:
Nuclear receptor ROR-gamma
Synonyms:
NR1F3 Nuclear receptor ROR-gamma (RORC) RAR-related orphan receptor C (RORc) RORG RZRG Retinoid-related orphan receptor-gamma (RORc)
Type:
Enzyme Catalytic Domain
Mol. Mass.:
58218.40
Organism:
Homo sapiens (Human)
Description:
P51449
Residue:
518
  
Inhibitor
Name:
BDBM50090123
Synonyms:
CHEMBL3581546 | US9216988, 29
Type:
Small organic molecule
Emp. Form.:
C24H30FN3O4S
Mol. Mass.:
475.576
SMILES:
COc1cccc(c1)S(=O)(=O)N(Cc1ccc(cc1F)N1CCN(CC1)C(C)=O)C1CCC1
: