Target
Nuclear receptor ROR-gamma
Ligand
BDBM197824
Substrate
Meas. Tech.
In Vitro Assay
pH
7.4±n/a
IC50
7±n/a nM
Comments
extracted
Citation
 Fauber, BRene, O Benzyl sulfonamide derivatives as RORc modulators US Patent  US9216988 Publication Date 12/22/2015 
Target
Name:
Nuclear receptor ROR-gamma
Synonyms:
NR1F3 Nuclear receptor ROR-gamma (RORC) RAR-related orphan receptor C (RORc) RORG RZRG Retinoid-related orphan receptor-gamma (RORc)
Type:
Enzyme Catalytic Domain
Mol. Mass.:
58218.40
Organism:
Homo sapiens (Human)
Description:
P51449
Residue:
518
  
Inhibitor
Name:
BDBM197824
Synonyms:
US9216988, 73
Type:
Small organic molecule
Emp. Form.:
C24H32FN3O3S
Mol. Mass.:
461.593
SMILES:
CC(C)CN(Cc1ccc(cc1F)N1CCN(CC1)C(C)=O)S(=O)(=O)Cc1ccccc1
: