Target
Nuclear receptor ROR-gamma
Ligand
BDBM197827
Substrate
Meas. Tech.
In Vitro Assay
pH
7.4±n/a
IC50
32±n/a nM
Comments
extracted
Citation
 Fauber, BRene, O Benzyl sulfonamide derivatives as RORc modulators US Patent  US9216988 Publication Date 12/22/2015 
Target
Name:
Nuclear receptor ROR-gamma
Synonyms:
NR1F3 Nuclear receptor ROR-gamma (RORC) RAR-related orphan receptor C (RORc) RORG RZRG Retinoid-related orphan receptor-gamma (RORc)
Type:
Enzyme Catalytic Domain
Mol. Mass.:
58218.40
Organism:
Homo sapiens (Human)
Description:
P51449
Residue:
518
  
Inhibitor
Name:
BDBM197827
Synonyms:
US9216988, 76
Type:
Small organic molecule
Emp. Form.:
C22H28F4N4O4S2
Mol. Mass.:
552.606
SMILES:
CN(C)S(=O)(=O)N1CCN(CC1)c1ccc(CN(CC(F)(F)F)S(=O)(=O)Cc2ccccc2)c(F)c1
: