Target
Nuclear receptor ROR-gamma
Ligand
BDBM197832
Substrate
Meas. Tech.
In Vitro Assay
pH
7.4±n/a
IC50
15±n/a nM
Comments
extracted
Citation
 Fauber, BRene, O Benzyl sulfonamide derivatives as RORc modulators US Patent  US9216988 Publication Date 12/22/2015 
Target
Name:
Nuclear receptor ROR-gamma
Synonyms:
NR1F3 Nuclear receptor ROR-gamma (RORC) RAR-related orphan receptor C (RORc) RORG RZRG Retinoid-related orphan receptor-gamma (RORc)
Type:
Enzyme Catalytic Domain
Mol. Mass.:
58218.40
Organism:
Homo sapiens (Human)
Description:
P51449
Residue:
518
  
Inhibitor
Name:
BDBM197832
Synonyms:
US9216988, 83
Type:
Small organic molecule
Emp. Form.:
C24H28Cl2FN3O3S
Mol. Mass.:
528.467
SMILES:
CC(=O)N1CCN(CC1)c1ccc(CN(C2CCC2)S(=O)(=O)Cc2ccc(Cl)cc2Cl)c(F)c1
: