Target
Nuclear receptor ROR-gamma
Ligand
BDBM50090096
Substrate
Meas. Tech.
In Vitro Assay
pH
7.4±n/a
IC50
36±n/a nM
Comments
extracted
Citation
 Fauber, BRene, O Benzyl sulfonamide derivatives as RORc modulators US Patent  US9216988 Publication Date 12/22/2015 
Target
Name:
Nuclear receptor ROR-gamma
Synonyms:
NR1F3 Nuclear receptor ROR-gamma (RORC) RAR-related orphan receptor C (RORc) RORG RZRG Retinoid-related orphan receptor-gamma (RORc)
Type:
Enzyme Catalytic Domain
Mol. Mass.:
58218.40
Organism:
Homo sapiens (Human)
Description:
P51449
Residue:
518
  
Inhibitor
Name:
BDBM50090096
Synonyms:
CHEMBL3580673 | US9216988, 86
Type:
Small organic molecule
Emp. Form.:
C24H29ClFN3O3S
Mol. Mass.:
494.022
SMILES:
CC(=O)N1CCN(CC1)c1ccc(CN(C2CCC2)S(=O)(=O)Cc2ccc(Cl)cc2)c(F)c1
: