Target
Nuclear receptor ROR-gamma
Ligand
BDBM197838
Substrate
Meas. Tech.
In Vitro Assay
pH
7.4±n/a
IC50
17±n/a nM
Comments
extracted
Citation
 Fauber, BRene, O Benzyl sulfonamide derivatives as RORc modulators US Patent  US9216988 Publication Date 12/22/2015 
Target
Name:
Nuclear receptor ROR-gamma
Synonyms:
NR1F3 Nuclear receptor ROR-gamma (RORC) RAR-related orphan receptor C (RORc) RORG RZRG Retinoid-related orphan receptor-gamma (RORc)
Type:
Enzyme Catalytic Domain
Mol. Mass.:
58218.40
Organism:
Homo sapiens (Human)
Description:
P51449
Residue:
518
  
Inhibitor
Name:
BDBM197838
Synonyms:
US9216988, 95
Type:
Small organic molecule
Emp. Form.:
C23H25F4N3O3S
Mol. Mass.:
499.522
SMILES:
CC(=O)N1C[C@@H]2C[C@H]1CN2c1ccc(CN(CC(F)(F)F)S(=O)(=O)Cc2ccccc2)c(F)c1
: