Target
Nuclear receptor ROR-gamma
Ligand
BDBM50044247
Substrate
Meas. Tech.
In Vitro Assay
pH
7.4±n/a
IC50
6±n/a nM
Comments
extracted
Citation
 Fauber, BRene, O Benzyl sulfonamide derivatives as RORc modulators US Patent  US9216988 Publication Date 12/22/2015 
Target
Name:
Nuclear receptor ROR-gamma
Synonyms:
NR1F3 Nuclear receptor ROR-gamma (RORC) RAR-related orphan receptor C (RORc) RORG RZRG Retinoid-related orphan receptor-gamma (RORc)
Type:
Enzyme Catalytic Domain
Mol. Mass.:
58218.40
Organism:
Homo sapiens (Human)
Description:
P51449
Residue:
518
  
Inhibitor
Name:
BDBM50044247
Synonyms:
CHEMBL3314036 | US9216988, 159
Type:
Small organic molecule
Emp. Form.:
C24H34N2O5S2
Mol. Mass.:
494.667
SMILES:
CC(C)CN(Cc1ccc(OC2CCN(CC2)S(C)(=O)=O)cc1)S(=O)(=O)Cc1ccccc1
: