Target
Nuclear receptor ROR-gamma
Ligand
BDBM197900
Substrate
Meas. Tech.
In Vitro Assay
pH
7.4±n/a
IC50
40±n/a nM
Comments
extracted
Citation
 Fauber, BRene, O Benzyl sulfonamide derivatives as RORc modulators US Patent  US9216988 Publication Date 12/22/2015 
Target
Name:
Nuclear receptor ROR-gamma
Synonyms:
NR1F3 Nuclear receptor ROR-gamma (RORC) RAR-related orphan receptor C (RORc) RORG RZRG Retinoid-related orphan receptor-gamma (RORc)
Type:
Enzyme Catalytic Domain
Mol. Mass.:
58218.40
Organism:
Homo sapiens (Human)
Description:
P51449
Residue:
518
  
Inhibitor
Name:
BDBM197900
Synonyms:
US9216988, 170
Type:
Small organic molecule
Emp. Form.:
C26H37N3O4S
Mol. Mass.:
487.655
SMILES:
CO[C@@H](C)C(=O)N1CCN(CC1)c1ccc(CN(CC(C)C)S(=O)(=O)Cc2ccccc2)cc1
: