Target
Nuclear receptor ROR-gamma
Ligand
BDBM197904
Substrate
Meas. Tech.
In Vitro Assay
pH
7.4±n/a
IC50
4±n/a nM
Comments
extracted
Citation
 Fauber, BRene, O Benzyl sulfonamide derivatives as RORc modulators US Patent  US9216988 Publication Date 12/22/2015 
Target
Name:
Nuclear receptor ROR-gamma
Synonyms:
NR1F3 Nuclear receptor ROR-gamma (RORC) RAR-related orphan receptor C (RORc) RORG RZRG Retinoid-related orphan receptor-gamma (RORc)
Type:
Enzyme Catalytic Domain
Mol. Mass.:
58218.40
Organism:
Homo sapiens (Human)
Description:
P51449
Residue:
518
  
Inhibitor
Name:
BDBM197904
Synonyms:
US9216988, 174
Type:
Small organic molecule
Emp. Form.:
C26H36N2O5S2
Mol. Mass.:
520.704
SMILES:
CC(C)CN(Cc1ccc(O[C@@H]2C[C@@H]3CC[C@H](C2)N3S(C)(=O)=O)cc1)S(=O)(=O)Cc1ccccc1
: