Target
Nuclear receptor ROR-gamma
Ligand
BDBM197925
Substrate
Meas. Tech.
In Vitro Assay
pH
7.4±n/a
IC50
29±n/a nM
Comments
extracted
Citation
 Fauber, BRene, O Benzyl sulfonamide derivatives as RORc modulators US Patent  US9216988 Publication Date 12/22/2015 
Target
Name:
Nuclear receptor ROR-gamma
Synonyms:
NR1F3 Nuclear receptor ROR-gamma (RORC) RAR-related orphan receptor C (RORc) RORG RZRG Retinoid-related orphan receptor-gamma (RORc)
Type:
Enzyme Catalytic Domain
Mol. Mass.:
58218.40
Organism:
Homo sapiens (Human)
Description:
P51449
Residue:
518
  
Inhibitor
Name:
BDBM197925
Synonyms:
US9216988, 195
Type:
Small organic molecule
Emp. Form.:
C25H37N3O4S2
Mol. Mass.:
507.709
SMILES:
CC(C)CN(Cc1ccc(NC2(C)CCN(CC2)S(C)(=O)=O)cc1)S(=O)(=O)Cc1ccccc1
: