Target
Nuclear receptor ROR-gamma
Ligand
BDBM197929
Substrate
Meas. Tech.
In Vitro Assay
pH
7.4±n/a
IC50
28±n/a nM
Comments
extracted
Citation
 Fauber, BRene, O Benzyl sulfonamide derivatives as RORc modulators US Patent  US9216988 Publication Date 12/22/2015 
Target
Name:
Nuclear receptor ROR-gamma
Synonyms:
NR1F3 Nuclear receptor ROR-gamma (RORC) RAR-related orphan receptor C (RORc) RORG RZRG Retinoid-related orphan receptor-gamma (RORc)
Type:
Enzyme Catalytic Domain
Mol. Mass.:
58218.40
Organism:
Homo sapiens (Human)
Description:
P51449
Residue:
518
  
Inhibitor
Name:
BDBM197929
Synonyms:
US9216988, 199
Type:
Small organic molecule
Emp. Form.:
C24H34FN3O4S2
Mol. Mass.:
511.673
SMILES:
CC(C)CN(Cc1ccc(N[C@@H]2CCN(C[C@@H]2F)S(C)(=O)=O)cc1)S(=O)(=O)Cc1ccccc1
: