Target
Acetylcholinesterase
Ligand
BDBM198158
Substrate
Meas. Tech.
In vitro AChE and BChE Assay
pH
8±n/a
IC50
3.9e+2± 4e+1 nM
Comments
extracted
Citation
 Ahmad, SIftikhar, FUllah, FSadiq, ARashid, U Rational design and synthesis of dihydropyrimidine based dual binding site acetylcholinesterase inhibitors. Bioorg Chem 69:91-101 (2016)  
Target
Name:
Acetylcholinesterase
Synonyms:
ACES_ELEEL Acetylcholinesterase (EeAChE) | ache
Type:
Enzyme
Mol. Mass.:
71812.79
Organism:
Electrophorus electricus (Electric eel)
Description:
Residue:
633
  
Inhibitor
Name:
BDBM198158
Synonyms:
2-(5-Acetyl-4-(4-(benzyloxy)phenyl)-6-methyl-1,4-dihydropyrimidin-2-ylthio)-N-phenyl acetamide (4d)
Type:
Small organic molecule
Emp. Form.:
C28H27N3O3S
Mol. Mass.:
485.597
SMILES:
CC(=O)C1=C(C)NC(Sc2ccccc2CC(N)=O)=NC1c1ccc(OCc2ccccc2)cc1
: