Target
Acetylcholinesterase
Ligand
BDBM198161
Substrate
Meas. Tech.
In vitro AChE and BChE Assay
pH
8±n/a
IC50
2.01e+3± 1.7e+2 nM
Comments
extracted
Citation
 Ahmad, SIftikhar, FUllah, FSadiq, ARashid, U Rational design and synthesis of dihydropyrimidine based dual binding site acetylcholinesterase inhibitors. Bioorg Chem 69:91-101 (2016)  
Target
Name:
Acetylcholinesterase
Synonyms:
ACES_ELEEL Acetylcholinesterase (EeAChE) | ache
Type:
Enzyme
Mol. Mass.:
71812.79
Organism:
Electrophorus electricus (Electric eel)
Description:
Residue:
633
  
Inhibitor
Name:
BDBM198161
Synonyms:
2-(5-Acetyl-4-(4-bromophenyl)-6-methyl-1,4-dihydropyrimidin-2-ylamino)-N-(4-chlorophenyl) acetamide (4g) | BDBM198169
Type:
Small organic molecule
Emp. Form.:
C21H20BrClN4O2
Mol. Mass.:
475.766
SMILES:
CC(=O)C1=C(C)NC(Nc2cc(Cl)ccc2CC(N)=O)=NC1c1ccc(Br)cc1
: