Target
Acetylcholinesterase
Ligand
BDBM198164
Substrate
Meas. Tech.
In vitro AChE and BChE Assay
pH
8±n/a
IC50
2.01e+3± 1.8e+2 nM
Comments
extracted
Citation
 Ahmad, SIftikhar, FUllah, FSadiq, ARashid, U Rational design and synthesis of dihydropyrimidine based dual binding site acetylcholinesterase inhibitors. Bioorg Chem 69:91-101 (2016)  
Target
Name:
Acetylcholinesterase
Synonyms:
ACES_ELEEL Acetylcholinesterase (EeAChE) | ache
Type:
Enzyme
Mol. Mass.:
71812.79
Organism:
Electrophorus electricus (Electric eel)
Description:
Residue:
633
  
Inhibitor
Name:
BDBM198164
Synonyms:
2-(5-Acetyl-6-methyl-4-phenyl-1,4-dihydropyrimidin-2-ylamino)-N-(4-chlorophenyl)acetamide (5b)
Type:
Small organic molecule
Emp. Form.:
C21H21ClN4O2
Mol. Mass.:
396.87
SMILES:
CC(=O)C1=C(C)NC(NCC(=O)Nc2ccc(Cl)cc2)=NC1c1ccccc1
: