Target
Acetylcholinesterase
Ligand
BDBM198167
Substrate
Meas. Tech.
In vitro AChE and BChE Assay
pH
8±n/a
IC50
3.13e+3± 2.6e+2 nM
Comments
extracted
Citation
 Ahmad, SIftikhar, FUllah, FSadiq, ARashid, U Rational design and synthesis of dihydropyrimidine based dual binding site acetylcholinesterase inhibitors. Bioorg Chem 69:91-101 (2016)  
Target
Name:
Acetylcholinesterase
Synonyms:
ACES_ELEEL Acetylcholinesterase (EeAChE) | ache
Type:
Enzyme
Mol. Mass.:
71812.79
Organism:
Electrophorus electricus (Electric eel)
Description:
Residue:
633
  
Inhibitor
Name:
BDBM198167
Synonyms:
2-(5-Acetyl-4-(4-bromophenyl)-6-methyl-1,4-dihydropyrimidin-2-ylamino)-N-p-tolylacetamide (5e)
Type:
Small organic molecule
Emp. Form.:
C22H23BrN4O2
Mol. Mass.:
455.348
SMILES:
CC(=O)C1=C(C)NC(NCC(=O)Nc2ccc(C)cc2)=NC1c1ccc(Br)cc1
: