Target
Carboxylic ester hydrolase
Ligand
BDBM198156
Substrate
Meas. Tech.
In vitro AChE and BChE Assay
pH
8±n/a
IC50
1.641e+4± 1.06e+3 nM
Comments
extracted
Citation
 Ahmad, SIftikhar, FUllah, FSadiq, ARashid, U Rational design and synthesis of dihydropyrimidine based dual binding site acetylcholinesterase inhibitors. Bioorg Chem 69:91-101 (2016)  
Target
Name:
Carboxylic ester hydrolase
Synonyms:
BuChE Butyrylcholine esterase Butyrylcholinesterase (BChE) Butyrylcholinesterase (EqBuChE) butyrylcholinesterase precursor
Type:
Protein
Mol. Mass.:
68842.83
Organism:
Equus caballus (Horse)
Description:
Q9N1N9
Residue:
602
  
Inhibitor
Name:
BDBM198156
Synonyms:
2-((5-Acetyl-6-methyl-4-phenyl-1,4-dihydropyrimidin-2-yl)thio)-N-(4-chlorophenyl)acetamide (4b)
Type:
Small organic molecule
Emp. Form.:
C21H20ClN3O2S
Mol. Mass.:
413.92
SMILES:
CC(=O)C1=C(C)NC(SCC(=O)Nc2ccc(Cl)cc2)=NC1c1ccccc1
: