Target
Carboxylic ester hydrolase
Ligand
BDBM198163
Substrate
Meas. Tech.
In vitro AChE and BChE Assay
pH
8±n/a
IC50
1.501e+4± 9.8e+2 nM
Comments
extracted
Citation
 Ahmad, SIftikhar, FUllah, FSadiq, ARashid, U Rational design and synthesis of dihydropyrimidine based dual binding site acetylcholinesterase inhibitors. Bioorg Chem 69:91-101 (2016)  
Target
Name:
Carboxylic ester hydrolase
Synonyms:
BuChE Butyrylcholine esterase Butyrylcholinesterase (BChE) Butyrylcholinesterase (EqBuChE) butyrylcholinesterase precursor
Type:
Protein
Mol. Mass.:
68842.83
Organism:
Equus caballus (Horse)
Description:
Q9N1N9
Residue:
602
  
Inhibitor
Name:
BDBM198163
Synonyms:
2-(5-Acetyl-6-methyl-4-phenyl-1,4-dihydropyrimidin-2-ylamino)-N-phenylacetamide (5a)
Type:
Small organic molecule
Emp. Form.:
C21H22N4O2
Mol. Mass.:
362.425
SMILES:
CC(=O)C1=C(C)NC(NCC(=O)Nc2ccccc2)=NC1c1ccccc1
: