Target
Carboxylic ester hydrolase
Ligand
BDBM198161
Substrate
Meas. Tech.
In vitro AChE and BChE Assay
pH
8±n/a
IC50
1.675e+4± 1.17e+3 nM
Comments
extracted
Citation
 Ahmad, SIftikhar, FUllah, FSadiq, ARashid, U Rational design and synthesis of dihydropyrimidine based dual binding site acetylcholinesterase inhibitors. Bioorg Chem 69:91-101 (2016)  
Target
Name:
Carboxylic ester hydrolase
Synonyms:
BuChE Butyrylcholine esterase Butyrylcholinesterase (BChE) Butyrylcholinesterase (EqBuChE) butyrylcholinesterase precursor
Type:
Protein
Mol. Mass.:
68842.83
Organism:
Equus caballus (Horse)
Description:
Q9N1N9
Residue:
602
  
Inhibitor
Name:
BDBM198161
Synonyms:
2-(5-Acetyl-4-(4-bromophenyl)-6-methyl-1,4-dihydropyrimidin-2-ylamino)-N-(4-chlorophenyl) acetamide (4g) | BDBM198169
Type:
Small organic molecule
Emp. Form.:
C21H20BrClN4O2
Mol. Mass.:
475.766
SMILES:
CC(=O)C1=C(C)NC(Nc2cc(Cl)ccc2CC(N)=O)=NC1c1ccc(Br)cc1
: