Target
Prostaglandin G/H synthase 2
Ligand
BDBM198174
Substrate
Meas. Tech.
In vitro COX Inhibition Assay
IC50
9.0e+2± 37 nM
Citation
 Banerjee, AGDas, NShengule, SASharma, PASrivastava, RSShrivastava, SK Design, synthesis, evaluation and molecular modelling studies of some novel 5,6-diphenyl-1,2,4-triazin-3(2H)-ones bearing five-member heterocyclic moieties as potential COX-2 inhibitors: A hybrid pharmacophore approach. Bioorg Chem 69:102-120 (2016)  
Target
Name:
Prostaglandin G/H synthase 2
Synonyms:
COX2 Cyclooxygenase-2 (COX-2) PTGS2 Prostaglandin G/H synthase (cyclooxygenase)
Type:
Protein
Mol. Mass.:
68976.98
Organism:
Ovis aries (Sheep)
Description:
Residue:
603
  
Inhibitor
Name:
BDBM198174
Synonyms:
2-((5-(4-Methoxyphenylamino)-1,3,4-thiadiazol-2-yl)methyl)-5,6-diphenyl-1,2,4-triazin-3(2H)-one (4c)
Type:
Small organic molecule
Emp. Form.:
C25H20N6O2S
Mol. Mass.:
468.53
SMILES:
COc1ccc(Nc2nnc(Cn3nc(-c4ccccc4)c(nc3=O)-c3ccccc3)s2)cc1
: