Target
Tyrosine-protein kinase JAK2
Ligand
BDBM198520
Substrate
Meas. Tech.
Enzyme Assay
pH
7.5±n/a
IC50
16±n/a nM
Citation
 Hayashi, KWatanabe, TToyama, KKamon, JMinami, MUni, MNasu, M Substituted pyrrolo[2,3-h][1,6]naphthyridines and compositions thereof as JAK inhibitors US Patent  US9216999 Publication Date 12/22/2015 
Target
Name:
Tyrosine-protein kinase JAK2
Synonyms:
JAK-2 JAK2_HUMAN Janus kinase 2 (JAK2) | Janus kinase 2 (a protein tyrosine kinase)
Type:
Protein
Mol. Mass.:
130684.68
Organism:
Homo sapiens (Human)
Description:
O60674
Residue:
1132
  
Inhibitor
Name:
BDBM198520
Synonyms:
US9216999, 317 | US9556187, Example 317
Type:
Small organic molecule
Emp. Form.:
C17H18F6N6
Mol. Mass.:
420.3554
SMILES:
FC(F)(F)C(NC[C@H]1CC[C@@H](CC1)c1nnn2cnc3[nH]ccc3c12)C(F)(F)F
: