Target
Tyrosine-protein kinase JAK3
Ligand
BDBM198219
Substrate
Meas. Tech.
Enzyme Assay
pH
7.5±n/a
IC50
>1000±n/a nM
Citation
 Hayashi, KWatanabe, TToyama, KKamon, JMinami, MUni, MNasu, M Substituted pyrrolo[2,3-h][1,6]naphthyridines and compositions thereof as JAK inhibitors US Patent  US9216999 Publication Date 12/22/2015 
Target
Name:
Tyrosine-protein kinase JAK3
Synonyms:
JAK-3 JAK3_HUMAN Janus kinase 3 (JAK3) L-JAK | Leukocyte janus kinase
Type:
Protein
Mol. Mass.:
125111.08
Organism:
Homo sapiens (Human)
Description:
P52333
Residue:
1124
  
Inhibitor
Name:
BDBM198219
Synonyms:
US9216999, 27 | US9556187, Example 27
Type:
Small organic molecule
Emp. Form.:
C12H14N6
Mol. Mass.:
242.2798
SMILES:
C1CC(CCN1)c1nnn2cnc3[nH]ccc3c12
: