Target
Non-receptor tyrosine-protein kinase TYK2
Ligand
BDBM198656
Substrate
Meas. Tech.
Enzyme Assay
pH
7.5±n/a
IC50
52±n/a nM
Citation
 Hayashi, KWatanabe, TToyama, KKamon, JMinami, MUni, MNasu, M Substituted pyrrolo[2,3-h][1,6]naphthyridines and compositions thereof as JAK inhibitors US Patent  US9216999 Publication Date 12/22/2015 
Target
Name:
Non-receptor tyrosine-protein kinase TYK2
Synonyms:
Non-receptor tyrosine-protein kinase TYK2 (TYK2) TYK2_HUMAN | Tyrosine-protein kinase TYK2
Type:
Protein
Mol. Mass.:
133666.03
Organism:
Homo sapiens (Human)
Description:
P29597
Residue:
1187
  
Inhibitor
Name:
BDBM198656
Synonyms:
US9216999, 445 | US9556187, Example 445
Type:
Small organic molecule
Emp. Form.:
C17H19N5O
Mol. Mass.:
309.3657
SMILES:
OC12CC3CC(C1)CC(C3)(C2)c1nnn2cnc3[nH]ccc3c12
: