Target
Glutamate receptor ionotropic, NMDA 2B
Ligand
BDBM198751
Substrate
Meas. Tech.
Radioligand Binding Assay
Temperature
323.15±n/a K
Ki
5.8±n/a nM
Comments
extracted
Citation
 King, DThompson, III, LAShi, JThangathirupathy, SWarrier, JSIslam, IMacor, JE Selective NR2B antagonists US Patent  US9221796 Publication Date 12/29/2015 
Target
Name:
Glutamate receptor ionotropic, NMDA 2B
Synonyms:
GluN2B Grin2b NMDA receptor subunit N2B (GluN2B) NMDE2_RAT | NR2B
Type:
Protein
Mol. Mass.:
166077.66
Organism:
Rattus norvegicus (Rat)
Description:
Q00960
Residue:
1482
  
Inhibitor
Name:
BDBM198751
Synonyms:
BDBM198752 US9221796, 53, P-1
Type:
Small organic molecule
Emp. Form.:
C23H23F5N2O2
Mol. Mass.:
454.4329
SMILES:
Oc1ccc(cc1)C1CCN(CC1(F)F)C1CCN(Cc2ccc(cc2)C(F)(F)F)C1=O
: