Target
MAP kinase-interacting serine/threonine-protein kinase 2
Ligand
BDBM289398
Substrate
Meas. Tech.
MNK2a In Vitro Kinase Assay (Assay 2)
Temperature
298.15±n/a K
IC50
3.00±n/a nM
Comments
extracted
Citation
 Kley, JBlum, AGottschling, DHehn, JPWiedenmayer, D Sulfoximine substituted quinazolines for pharmaceutical compositions US Patent  US10093660 Publication Date 10/9/2018 
Target
Name:
MAP kinase-interacting serine/threonine-protein kinase 2
Synonyms:
GPRK7 MAP kinase-interacting serine/threonine-protein kinase 2 (MKNK2) MAP-kinase interacting kinase 2 (MNK2) MKNK2_HUMAN | MNK2
Type:
Protein
Mol. Mass.:
51870.79
Organism:
Homo sapiens (Human)
Description:
Q9HBH9
Residue:
465
  
Inhibitor
Name:
BDBM289398
Synonyms:
US10093660, Example 10.3
Type:
Small organic molecule
Emp. Form.:
C23H25F3N4O4S
Mol. Mass.:
510.529
SMILES:
Cc1cc(cc2ncnc(Nc3ccc(F)cc3O[C@H]3COC[C@H]3OCC(F)F)c12)N=S(C)(C)=O
: