Target
MAP kinase-interacting serine/threonine-protein kinase 1
Ligand
BDBM289398
Substrate
Meas. Tech.
MNK1 In Vitro Kinase Assay (Assay 3)
IC50
41.0±n/a nM
Citation
 Kley, JBlum, AGottschling, DHehn, JPWiedenmayer, D Sulfoximine substituted quinazolines for pharmaceutical compositions US Patent  US10093660 Publication Date 10/9/2018 
Target
Name:
MAP kinase-interacting serine/threonine-protein kinase 1
Synonyms:
MAP Kinase-Interacting Protein Kinase (MNK1) MAP kinase-interacting serine/threonine-protein kinase 1 (MnK1) MAP-kinase interacting kinase 1 (MNK1) MKNK1 MNK1
Type:
Serine/threonine-protein kinase
Mol. Mass.:
51342.85
Organism:
Homo sapiens (Human)
Description:
Q9BUB5
Residue:
465
  
Inhibitor
Name:
BDBM289398
Synonyms:
US10093660, Example 10.3
Type:
Small organic molecule
Emp. Form.:
C23H25F3N4O4S
Mol. Mass.:
510.529
SMILES:
Cc1cc(cc2ncnc(Nc3ccc(F)cc3O[C@H]3COC[C@H]3OCC(F)F)c12)N=S(C)(C)=O
: