Target
Beta-secretase 1
Ligand
BDBM199101
Substrate
Meas. Tech.
Homogeneous Time-Resolved FRET Assay
pH
5±n/a
Temperature
303.15±n/a K
Ki
5.07±n/a nM
Comments
extracted
Citation
 Cumming, JNGilbert, EJStamford, AW C5-C6 oxacyclic-fused thiadiazine dioxide compounds as BACE inhibitors, compositions, and their use US Patent  US9221839 Publication Date 12/29/2015 
Target
Name:
Beta-secretase 1
Synonyms:
ASP2 Aspartyl protease 2 BACE1 Beta-secretase (BACE) Beta-secretase 1 (BACE 1) Beta-secretase 1 (BACE1) Beta-site amyloid precursor protein cleaving enzyme 1 Memapsin-2 beta-Secretase (BACE-1) | beta-Secretase (BACE1)
Type:
Protein
Mol. Mass.:
55755.10
Organism:
Homo sapiens (Human)
Description:
P56817
Residue:
501
  
Inhibitor
Name:
BDBM199101
Synonyms:
US9221839, 5
Type:
Small organic molecule
Emp. Form.:
C18H17ClFN5O4S
Mol. Mass.:
453.875
SMILES:
CN1C(=N)N[C@]2(COC[C@H]2S1(=O)=O)c1cc(NC(=O)c2ccc(Cl)cn2)ccc1F
: