Target
Beta-secretase 2
Ligand
BDBM199099
Substrate
Meas. Tech.
Time-Resolved Endpoint Proteolysis Assay
pH
5±n/a
Temperature
303.15±n/a K
Ki
1509±n/a nM
Comments
extracted
Citation
 Cumming, JNGilbert, EJStamford, AW C5-C6 oxacyclic-fused thiadiazine dioxide compounds as BACE inhibitors, compositions, and their use US Patent  US9221839 Publication Date 12/29/2015 
Target
Name:
Beta-secretase 2
Synonyms:
AEPLC ASP1 Asp 1 Aspartyl protease 1 BACE2_HUMAN Beta-secretase (BACE) Beta-secretase 2 (BACE-2) Beta-site APP-cleaving enzyme 2 Memapsin-1 beta-Secretase (BACE-2)
Type:
Protein
Mol. Mass.:
56171.20
Organism:
Homo sapiens (Human)
Description:
Q9Y5Z0
Residue:
518
  
Inhibitor
Name:
BDBM199099
Synonyms:
US9221839, 4a
Type:
Small organic molecule
Emp. Form.:
C18H19FN6O5S
Mol. Mass.:
450.444
SMILES:
COc1cnc(cn1)C(=O)Nc1ccc(F)c(c1)[C@@]12COC[C@@H]1S(=O)(=O)N(C)C(=N)N2
: