Target
Beta-secretase 2
Ligand
BDBM199117
Substrate
Meas. Tech.
Time-Resolved Endpoint Proteolysis Assay
pH
5±n/a
Temperature
303.15±n/a K
Ki
4204±n/a nM
Comments
extracted
Citation
 Cumming, JNGilbert, EJStamford, AW C5-C6 oxacyclic-fused thiadiazine dioxide compounds as BACE inhibitors, compositions, and their use US Patent  US9221839 Publication Date 12/29/2015 
Target
Name:
Beta-secretase 2
Synonyms:
AEPLC ASP1 Asp 1 Aspartyl protease 1 BACE2_HUMAN Beta-secretase (BACE) Beta-secretase 2 (BACE-2) Beta-site APP-cleaving enzyme 2 Memapsin-1 beta-Secretase (BACE-2)
Type:
Protein
Mol. Mass.:
56171.20
Organism:
Homo sapiens (Human)
Description:
Q9Y5Z0
Residue:
518
  
Inhibitor
Name:
BDBM199117
Synonyms:
US9221839, 6f
Type:
Small organic molecule
Emp. Form.:
C12H14FN3O3S
Mol. Mass.:
299.321
SMILES:
CN1C(=N)NC2(COCC2S1(=O)=O)c1ccccc1F
: