Target
Mitogen-activated protein kinase 1
Ligand
BDBM199633
Substrate
Meas. Tech.
IMAP-FP Assay
IC50
8.8±n/a nM
Citation
Target
Name:
Mitogen-activated protein kinase 1
Synonyms:
ERK2 Extracellular signal-regulated kinase 2 Extracellular signal-regulated kinase 2 (ERK2) MAPK 2 MK01_HUMAN Mitogen-activated protein kinase 1 (ERK-2) Mitogen-activated protein kinase 2 PRKM2 | p42-MAPK
Type:
Ser/Thr Protein Kinase
Mol. Mass.:
41392.76
Organism:
Homo sapiens (Human)
Description:
P28482
Residue:
360
  
Inhibitor
Name:
BDBM199633
Synonyms:
US9226922, 269
Type:
Small organic molecule
Emp. Form.:
C21H23N7O4
Mol. Mass.:
437.4518
SMILES:
COc1n[nH]c2cc(NC(=O)N[C@@H](c3ccccc3)C(C)(C)O)nc(-c3nnc(C)o3)c12
: