Target
Mitogen-activated protein kinase 1
Ligand
BDBM199661
Substrate
Meas. Tech.
IMAP-FP Assay
IC50
20.3±n/a nM
Citation
Target
Name:
Mitogen-activated protein kinase 1
Synonyms:
ERK2 Extracellular signal-regulated kinase 2 Extracellular signal-regulated kinase 2 (ERK2) MAPK 2 MK01_HUMAN Mitogen-activated protein kinase 1 (ERK-2) Mitogen-activated protein kinase 2 PRKM2 | p42-MAPK
Type:
Ser/Thr Protein Kinase
Mol. Mass.:
41392.76
Organism:
Homo sapiens (Human)
Description:
P28482
Residue:
360
  
Inhibitor
Name:
BDBM199661
Synonyms:
US9226922, 297
Type:
Small organic molecule
Emp. Form.:
C16H15Cl2N5O2
Mol. Mass.:
380.229
SMILES:
COc1n[nH]c2cc(NC(=O)N[C@H](C)c3ccc(Cl)c(Cl)c3)ncc12
: