Target
Muscarinic acetylcholine receptor M3
Ligand
BDBM200745
Substrate
Meas. Tech.
Muscarinic Receptor Binding Assay
IC50
1.4±n/a nM
Citation
 Aiguade Bosch, JGual Roig, SPrat Quinones, MPuig Duran, C Cyclohexylamine derivatives having β2 adrenergic agonist and M3 muscarinic antagonist activities US Patent  US9233108 Publication Date 1/12/2016 
Target
Name:
Muscarinic acetylcholine receptor M3
Synonyms:
ACM3_HUMAN Cholinergic, muscarinic M3 Muscarinic receptor M3 | RecName: Full=Muscarinic acetylcholine receptor M3
Type:
Enzyme
Mol. Mass.:
66151.03
Organism:
Homo sapiens (Human)
Description:
P20309
Residue:
590
  
Inhibitor
Name:
BDBM200745
Synonyms:
US9233108, 6
Type:
Small organic molecule
Emp. Form.:
C40H45N4O8S2
Mol. Mass.:
773.938
SMILES:
CN(CCN(C)C(=O)COc1ccc(CNC[C@H](O)c2ccc(O)c3[nH]c(=O)ccc23)cc1)[C@H]1CC[C@@H](CC1)OC(C([O-])=O)(c1cccs1)c1cccs1
: