Target
Alpha-1,6-mannosyl-glycoprotein 2-beta-N-acetylglucosaminyltransferase
Ligand
BDBM201269
Substrate
Meas. Tech.
MGAT LCMS Assay
pH
7.4±n/a
IC50
370±n/a nM
Comments
extracted
Citation
 Turdi, HHangeland, JJLawrence, RMCheng, DAhmad, SMeng, WBrigance, RPDevasthale, PZhao, G Aryl dihydropyridinones and piperidinone MGAT2 inhibitors US Patent  US9187424 Publication Date 11/17/2015 
Target
Name:
Alpha-1,6-mannosyl-glycoprotein 2-beta-N-acetylglucosaminyltransferase
Synonyms:
2.4.1.143 GNT-II MGAT2 Mannoside acetylglucosaminyltransferase 2 Monoacylglycerol acyltransferase type 2 (h-MGAT2) h-MGAT2 (human monoacylglycerol acyltransferase type 2)
Type:
Mol. Mass.:
51567.80
Organism:
Homo sapiens (Human)
Description:
Q10469
Residue:
447
  
Inhibitor
Name:
BDBM201269
Synonyms:
US9187424, 269 US9187424, 53 | US9187424, 76
Type:
Small organic molecule
Emp. Form.:
C24H20F6N2O2
Mol. Mass.:
482.4182
SMILES:
Cc1ccc(cc1)C1=C(C#N)C(=O)NC(C1)(c1ccc(OCCCC(F)(F)F)cc1)C(F)(F)F
: