Target
3-phosphoinositide-dependent protein kinase 1
Ligand
BDBM117045
Substrate
Meas. Tech.
Luminex Assay
pH
8±n/a
Temperature
277.15±n/a K
IC50
35±n/a nM
Comments
extracted
Citation
 Heinrich, TWucherer-Plietker, MBuchstaller, H 1-H-pyrrolo[2,3-b]pyridine derivatives US Patent  US9238651 Publication Date 1/19/2016 
Target
Name:
3-phosphoinositide-dependent protein kinase 1
Synonyms:
3-Phosphoinositide-Dependent Protein Kinase 1 (PDK1) 3-phosphoinositide-dependent protein kinase 1 3-phosphoinositide-dependent protein kinase 1 (PDK-1) Isoform 2 of 3-phosphoinositide-dependent protein kinase 1 PDPK1 Phosphoinositide-dependent protein kinase 1 (PDK1) hPDK1
Type:
Enzyme
Mol. Mass.:
63157.65
Organism:
Homo sapiens (Human)
Description:
O15530
Residue:
556
  
Inhibitor
Name:
BDBM117045
Synonyms:
US8664236, A25 | US9238651, A25
Type:
Small organic molecule
Emp. Form.:
C23H20F2N8O
Mol. Mass.:
462.4547
SMILES:
Cn1cc(cn1)-c1cnc2[nH]cc(-c3cc(nc(N)n3)N(CCO)c3ccc(F)cc3F)c2c1
: