Target
Aromatase
Ligand
BDBM202575
Substrate
Meas. Tech.
Aromatase Inhibition Activity Assay
pH
7.5±n/a
Temperature
310.15±n/a K
IC50
3.9± 0.2 nM
Comments
extracted
Citation
 Yi, XJEl-Idreesy, TTEldebss, TMFarag, AMAbdulla, MMHassan, SAMabkhot, YN Synthesis, biological evaluation, and molecular docking studies of new pyrazol-3-one derivatives with aromatase inhibition activities. Chem Biol Drug Des 88:832-843 (2016)  
Target
Name:
Aromatase
Synonyms:
ARO1 CP19A_HUMAN CYP19 CYPXIX Cytochrome P450 19A1 Cytochrome P450-C19 (CYP19) FL cytokine receptor precursor | P-450AROM
Type:
Enzyme
Mol. Mass.:
57888.92
Organism:
Homo sapiens (Human)
Description:
P11511
Residue:
503
  
Inhibitor
Name:
BDBM202575
Synonyms:
2-[4-(1,2-Dihydro-1,5-dimethyl-2-phenyl-3-oxo-3H-pyrazol-4-yl]-1,3,4-thiazolo[3,2-a]-1,3-quinazolin-2-one (10b)
Type:
Small organic molecule
Emp. Form.:
C21H15N5O3S
Mol. Mass.:
417.441
SMILES:
Cc1c(C(=O)c2nn3c(nc(=O)c4ccccc34)s2)c(=O)n(-c2ccccc2)n1C
: