Target
Sodium-dependent noradrenaline transporter
Ligand
BDBM202590
Substrate
Meas. Tech.
Radioligand Binding Assay
Ki
119.00±n/a nM
Citation
 Bhat, LAdiey, KBhat, SR Compositions, synthesis, and methods of using phenylcycloalkylmethylamine derivatives US Patent  US9238625 Publication Date 1/19/2016 
Target
Name:
Sodium-dependent noradrenaline transporter
Synonyms:
Monoamine transporter NET Noradrenaline Transporter (NET) Norepinephrine transporter protein (NET) SLC6A2 Sodium-dependent noradrenaline transporter (NET) | Solute carrier family 6 member 2
Type:
Multi-pass membrane protein
Mol. Mass.:
69337.72
Organism:
Homo sapiens (Human)
Description:
P23975
Residue:
617
  
Inhibitor
Name:
BDBM202590
Synonyms:
US9238625, 13f
Type:
Small organic molecule
Emp. Form.:
C17H25Cl2NS
Mol. Mass.:
346.358
SMILES:
CCSCCNC(CC)C1(CCC1)c1ccc(Cl)c(Cl)c1
: