Target
RAF proto-oncogene serine/threonine-protein kinase [1-324]
Ligand
BDBM202846
Substrate
Meas. Tech.
In Vitro Enzyme Assay
pH
7.5±n/a
Temperature
298.15±n/a K
IC50
1.292±n/a nM
Comments
extracted
Citation
 Barsanti, PABurger, MLou, YNishiguchi, GPolyakov, VRamurthy, SRico, ASetti, LSmith, ATaft, BTanner, HDiPesa, AYusuff, N Biaryl amide compounds as kinase inhibitors US Patent  US9242969 Publication Date 1/26/2016 
Target
Name:
RAF proto-oncogene serine/threonine-protein kinase [1-324]
Synonyms:
C-Raf TR (aa 1-324) RAF RAF1_HUMAN
Type:
Mol. Mass.:
36996.69
Organism:
Homo sapiens (Human)
Description:
P04049 (1-324)
Residue:
324
  
Inhibitor
Name:
BDBM202846
Synonyms:
US10245267, Example 199 US9242969, 199 | US9694016, 199
Type:
Small organic molecule
Emp. Form.:
C22H20F3N3O2S
Mol. Mass.:
447.473
SMILES:
Cc1ccc(NC(=O)c2cccc(c2)C(F)(F)F)cc1-c1csc(n1)N1CCOCC1
: