Target
Interleukin-1 receptor-associated kinase 4
Ligand
BDBM203549
Substrate
Meas. Tech.
IMAP technology (Molecular Devices)
pH
7.2±n/a
Temperature
298.15±n/a K
IC50
244±n/a nM
Comments
extracted
Citation
 Seganish, WMBrumfield, SNLim, JMatasi, JJMcElroy, WTTulshian, DBLavey, BJAltman, MDGibeau, CRLampe, JWMethot, JZhu, L Aminopyrimidinones as interleukin receptor-associated kinase inhibitors US Patent  US9221809 Publication Date 12/29/2015 
Target
Name:
Interleukin-1 receptor-associated kinase 4
Synonyms:
IRAK-4 IRAK4_HUMAN Interleukin-1 receptor-associated kinase 4 (IRAK4) | Renal carcinoma antigen NY-REN-64
Type:
Protein
Mol. Mass.:
51519.08
Organism:
Homo sapiens (Human)
Description:
Q9NWZ3
Residue:
460
  
Inhibitor
Name:
BDBM203549
Synonyms:
US9221809, 106
Type:
Small organic molecule
Emp. Form.:
C20H24N6O2S
Mol. Mass.:
412.509
SMILES:
O=c1[nH]c(nc(NC2CCCNC2)c1-c1nc2ccccc2s1)N1CCOCC1
: